Reaction Details
TargetTyrosine-protein kinase SYK
LigandBDBM205299
Substrate/Competitorn/a
Meas. Tech.c-Src and Syk Enzyme Inhibition Assay
IC50 18±n/a nM
Citation Duffy, LAKing-Underwood, JLongshaw, AIMurray, PJOnions, STTaddei, DMWilliams, JGIto, KCharron, CE Pyrazole derivatives as p38 MAP inhibitors US Patent US9249125 Publication Date 2/2/2016
 
Tyrosine-protein kinase SYK
Name:Tyrosine-protein kinase SYK
Type:Enzyme
Mol. Mass.:72079.99
Organism:Homo sapiens (Human)
Description:P43405
Residue:635
BDBM205299
NameBDBM205299
Synonyms:US9249125, 52
TypeSmall organic molecule
Emp. Form.C42H43N9O4
Mol. Mass.737.8487
SMILESCC(C)(C)c1cc(NC(=O)Nc2ccc(Oc3ccnc(Nc4ccc5[nH]ncc5c4)c3)c3ccccc23)n(n1)-c1cccc(OCCN2CCOCC2)c1