Reaction Details
TargetBromodomain-containing protein 3 [24-144]
LigandBDBM205431
Substrate/Competitorn/a
Meas. Tech.Bromodomains Assay for DiscoveRx Gene Symbol
Ki 0.13±0.0 nM
Citation Tanaka, MRoberts, JMSeo, HSSouza, APaulk, JScott, TGDeAngelo, SLDhe-Paganon, SBradner, JE Design and characterization of bivalent BET inhibitors. Nat Chem Biol12:1089-1096 (2016) 
 
Bromodomain-containing protein 3 [24-144]
Name:Bromodomain-containing protein 3 [24-144]
Type:n/a
Mol. Mass.:14355.47
Organism:Homo sapiens (Human)
Description:Q15059 (BRD3, 24-144)
Residue:121
BDBM205431
NameBDBM205431
Synonyms:(6S+2S)-PEG1 (7)
TypeSmall organic molecule
Emp. Form.C43H42Cl2N10O5S2
Mol. Mass.913.894
SMILESCOC(=O)C[C@@H]1N=C(c2c(C)c(sc2-n2c(C)nnc12)C(=O)NCCOCCNC(=O)C[C@@H]1N=C(c2c(C)c(C)sc2-n2c(C)nnc12)c1ccc(Cl)cc1)c1ccc(Cl)cc1