Reaction Details
TargetIsoform C of Bromodomain-containing protein 4 (Short)
LigandBDBM205453
Substrate/Competitorn/a
Meas. Tech.Bromodomains Assay for DiscoveRx Gene Symbol
Ki 0.062±0.0 nM
Citation Tanaka, MRoberts, JMSeo, HSSouza, APaulk, JScott, TGDeAngelo, SLDhe-Paganon, SBradner, JE Design and characterization of bivalent BET inhibitors. Nat Chem Biol12:1089-1096 (2016) 
 
Isoform C of Bromodomain-containing protein 4 (Short)
Name:Isoform C of Bromodomain-containing protein 4 (Short)
Type:n/a
Mol. Mass.:80477.46
Organism:Homo sapiens (Human)
Description:O60885-2
Residue:722
BDBM205453
NameBDBM205453
Synonyms:MTI (35)
TypeSmall organic molecule
Emp. Form.C54H66Cl2N10O9S2
Mol. Mass.1134.199
SMILESCc1sc-2c(c1C)C(=NC(CC(=O)NCCOCCOCCOCCOCCOCCOCCOCCNC(=O)C[C@@H]1N=C(c3c(C)c(C)sc3-n3c(C)nnc13)c1ccc(Cl)cc1)c1nnc(C)n-21)c1ccc(Cl)cc1