Reaction Details
TargetBromodomain testis-specific protein [21-137,251-382]
LigandBDBM205453
Substrate/Competitorn/a
Meas. Tech.Bromodomains Assay for DiscoveRx Gene Symbol
Ki 0.076±0.0 nM
Citation Tanaka, MRoberts, JMSeo, HSSouza, APaulk, JScott, TGDeAngelo, SLDhe-Paganon, SBradner, JE Design and characterization of bivalent BET inhibitors. Nat Chem Biol12:1089-1096 (2016) 
 
Bromodomain testis-specific protein [21-137,251-382]
Name:Bromodomain testis-specific protein [21-137,251-382]
Type:n/a
Mol. Mass.:29512.81
Organism:Homo sapiens (Human)
Description:Q58F21 (BRDT, 21-137 and 251-382)
Residue:249
BDBM205453
NameBDBM205453
Synonyms:MTI (35)
TypeSmall organic molecule
Emp. Form.C54H66Cl2N10O9S2
Mol. Mass.1134.199
SMILESCc1sc-2c(c1C)C(=NC(CC(=O)NCCOCCOCCOCCOCCOCCOCCOCCNC(=O)C[C@@H]1N=C(c3c(C)c(C)sc3-n3c(C)nnc13)c1ccc(Cl)cc1)c1nnc(C)n-21)c1ccc(Cl)cc1