Reaction Details
TargetBromodomain testis-specific protein [21-137,251-382]
LigandBDBM205431
Substrate/Competitorn/a
Meas. Tech.BROMOscan Assay
Kd 0.039±0.0 nM
Citation Tanaka, MRoberts, JMSeo, HSSouza, APaulk, JScott, TGDeAngelo, SLDhe-Paganon, SBradner, JE Design and characterization of bivalent BET inhibitors. Nat Chem Biol12:1089-1096 (2016) 
 
Bromodomain testis-specific protein [21-137,251-382]
Name:Bromodomain testis-specific protein [21-137,251-382]
Type:n/a
Mol. Mass.:29512.81
Organism:Homo sapiens (Human)
Description:Q58F21 (BRDT, 21-137 and 251-382)
Residue:249
BDBM205431
NameBDBM205431
Synonyms:(6S+2S)-PEG1 (7)
TypeSmall organic molecule
Emp. Form.C43H42Cl2N10O5S2
Mol. Mass.913.894
SMILESCOC(=O)C[C@@H]1N=C(c2c(C)c(sc2-n2c(C)nnc12)C(=O)NCCOCCNC(=O)C[C@@H]1N=C(c2c(C)c(C)sc2-n2c(C)nnc12)c1ccc(Cl)cc1)c1ccc(Cl)cc1