Reaction Details
TargetBromodomain testis-specific protein [21-137]
LigandBDBM205430
Substrate/Competitorn/a
Meas. Tech.AlphaScreen BRD Binding Assay
pH7.5±n/a
Temperature298.15±n/a K
IC50 2.36±0.0 nM
Commentsextracted
Citation Tanaka, MRoberts, JMSeo, HSSouza, APaulk, JScott, TGDeAngelo, SLDhe-Paganon, SBradner, JE Design and characterization of bivalent BET inhibitors. Nat Chem Biol12:1089-1096 (2016) 
 
Bromodomain testis-specific protein [21-137]
Name:Bromodomain testis-specific protein [21-137]
Type:n/a
Mol. Mass.:13934.55
Organism:Homo sapiens (Human)
Description:Q58F21 (BRDT, 21-137)
Residue:117
BDBM205430
NameBDBM205430
Synonyms:(6S+2S)-PEG0 (6)
TypeSmall organic molecule
Emp. Form.C41H38Cl2N10O4S2
Mol. Mass.869.841
SMILESCOC(=O)C[C@@H]1N=C(c2c(C)c(sc2-n2c(C)nnc12)C(=O)NCCNC(=O)C[C@@H]1N=C(c2c(C)c(C)sc2-n2c(C)nnc12)c1ccc(Cl)cc1)c1ccc(Cl)cc1