Reaction Details
TargetBromodomain-containing protein 4 [44-168]
LigandBDBM205441
Substrate/Competitorn/a
Meas. Tech.AlphaScreen BRD Binding Assay
pH7.5±n/a
Temperature298.15±n/a K
IC50 11.5±0.0 nM
Commentsextracted
Citation Tanaka, MRoberts, JMSeo, HSSouza, APaulk, JScott, TGDeAngelo, SLDhe-Paganon, SBradner, JE Design and characterization of bivalent BET inhibitors. Nat Chem Biol12:1089-1096 (2016) 
 
Bromodomain-containing protein 4 [44-168]
Name:Bromodomain-containing protein 4 [44-168]
Type:Enzyme Catalytic Domain
Mol. Mass.:14866.49
Organism:Homo sapiens (Human)
Description:aa (44-168)
Residue:125
BDBM205441
NameBDBM205441
Synonyms:6S+IBET-PEG7 (22)
TypeSmall organic molecule
Emp. Form.C60H72ClN11O12S
Mol. Mass.1206.798
SMILESCOc1cc2c3n([C@H](C)c4ccccn4)c(=O)n(CC(=O)NCCOCCOCCOCCOCCOCCOCCOCCNC(=O)C[C@@H]4N=C(c5c(C)c(C)sc5-n5c(C)nnc45)c4ccc(Cl)cc4)c3cnc2cc1-c1c(C)noc1C