Reaction Details
TargetBromodomain testis-specific protein [21-137]
LigandBDBM205452
Substrate/Competitorn/a
Meas. Tech.AlphaScreen BRD Binding Assay
pH7.5±n/a
Temperature298.15±n/a K
IC50 13.6±0.0 nM
Commentsextracted
Citation Tanaka, MRoberts, JMSeo, HSSouza, APaulk, JScott, TGDeAngelo, SLDhe-Paganon, SBradner, JE Design and characterization of bivalent BET inhibitors. Nat Chem Biol12:1089-1096 (2016) 
 
Bromodomain testis-specific protein [21-137]
Name:Bromodomain testis-specific protein [21-137]
Type:n/a
Mol. Mass.:13934.55
Organism:Homo sapiens (Human)
Description:Q58F21 (BRDT, 21-137)
Residue:117
BDBM205452
NameBDBM205452
Synonyms:IBETx2-PEG7 (34)
TypeSmall organic molecule
Emp. Form.C66H78N12O15
Mol. Mass.1279.3969
SMILESCOc1cc2c3n([C@@H](C)c4ccccn4)c(=O)n(CC(=O)NCCOCCOCCOCCOCCOCCOCCOCCNC(=O)Cn4c5cnc6cc(-c7c(C)noc7C)c(OC)cc6c5n([C@H](C)c5ccccn5)c4=O)c3cnc2cc1-c1c(C)noc1C