Reaction Details
TargetInorganic pyrophosphatase
LigandBDBM205472
Substrate/Competitorn/a
Meas. Tech.Colorimetric Malachite Green Assay
pH7.5±n/a
Temperature298.15±n/a K
IC50 2.3e+4± 1e+3 nM
Commentsextracted
Citation Pang, AHGarzan, ALarsen, MJMcQuade, TJGarneau-Tsodikova, STsodikov, OV Discovery of Allosteric and Selective Inhibitors of Inorganic Pyrophosphatase from Mycobacterium tuberculosis. ACS Chem Biol11:3084-3092 (2016) 
 
Inorganic pyrophosphatase
Name:Inorganic pyrophosphatase
Type:Protein
Mol. Mass.:18318.35
Organism:Mycobacterium tuberculosis
Description:P9WI55
Residue:162
BDBM205472
NameBDBM205472
Synonyms:PPiase inhibitor, 16
TypeSmall organic molecule
Emp. Form.C29H42N6
Mol. Mass.474.684
SMILESCCCCN(CCCC)c1nc(nc(n1)-c1cccn1CCc1ccccc1)N1CCCCCC1