Reaction Details
TargetInorganic pyrophosphatase
LigandBDBM205473
Substrate/Competitorn/a
Meas. Tech.Colorimetric Malachite Green Assay
pH7.5±n/a
Temperature298.15±n/a K
IC50 2.21e+5± 4.4e+4 nM
Commentsextracted
Citation Pang, AHGarzan, ALarsen, MJMcQuade, TJGarneau-Tsodikova, STsodikov, OV Discovery of Allosteric and Selective Inhibitors of Inorganic Pyrophosphatase from Mycobacterium tuberculosis. ACS Chem Biol11:3084-3092 (2016) 
 
Inorganic pyrophosphatase
Name:Inorganic pyrophosphatase
Type:Protein
Mol. Mass.:19696.77
Organism:Escherichia coli (Enterobacteria)
Description:P0A7A9
Residue:176
BDBM205473
NameBDBM205473
Synonyms:PPiase inhibitor, 17
TypeSmall organic molecule
Emp. Form.C30H44N6
Mol. Mass.488.7106
SMILESCCCCN(CCCC)c1nc(nc(n1)-c1cccn1CCCc1ccccc1)N1CCCCCC1