Reaction Details
TargetInorganic pyrophosphatase
LigandBDBM205468
Substrate/Competitorn/a
Meas. Tech.Colorimetric Malachite Green Assay
pH7.5±n/a
Temperature298.15±n/a K
IC50>6.00e+5±n/a nM
Commentsextracted
Citation Pang, AHGarzan, ALarsen, MJMcQuade, TJGarneau-Tsodikova, STsodikov, OV Discovery of Allosteric and Selective Inhibitors of Inorganic Pyrophosphatase from Mycobacterium tuberculosis. ACS Chem Biol11:3084-3092 (2016) 
 
Inorganic pyrophosphatase
Name:Inorganic pyrophosphatase
Type:Protein
Mol. Mass.:32294.13
Organism:Saccharomyces cerevisiae (Yeast)
Description:P00817
Residue:287
BDBM205468
NameBDBM205468
Synonyms:PPiase inhibitor, 12
TypeSmall organic molecule
Emp. Form.C21H26N6
Mol. Mass.362.4713
SMILESCN(C)c1nc(nc(n1)-c1cccn1-c1ccccc1)N1CCCCCC1