Reaction Details
TargetInorganic pyrophosphatase
LigandBDBM205477
Substrate/Competitorn/a
Meas. Tech.Colorimetric Malachite Green Assay
pH7.5±n/a
Temperature298.15±n/a K
IC50>6.00e+5±n/a nM
Commentsextracted
Citation Pang, AHGarzan, ALarsen, MJMcQuade, TJGarneau-Tsodikova, STsodikov, OV Discovery of Allosteric and Selective Inhibitors of Inorganic Pyrophosphatase from Mycobacterium tuberculosis. ACS Chem Biol11:3084-3092 (2016) 
 
Inorganic pyrophosphatase
Name:Inorganic pyrophosphatase
Type:Protein
Mol. Mass.:32294.13
Organism:Saccharomyces cerevisiae (Yeast)
Description:P00817
Residue:287
BDBM205477
NameBDBM205477
Synonyms:PPiase inhibitor, 21
TypeSmall organic molecule
Emp. Form.C27H36N6
Mol. Mass.444.6149
SMILESCc1cc(C)cc(c1)-n1cccc1-c1nc(nc(n1)N1CCCCCC1)N1CCCCCC1