Reaction Details
TargetProstaglandin G/H synthase 2 [18-604,S516A]
LigandBDBM50312668
Substrate/Competitorn/a
Meas. Tech.COX Enzyme Inhibition Assay (Table 2)
IC50 1.5e+3±n/a nM
Citation Uddin, MJCrews, BCXu, SGhebreselasie, KDaniel, CKKingsley, PJBanerjee, SMarnett, LJ Antitumor Activity of Cytotoxic Cyclooxygenase-2 Inhibitors. ACS Chem Biol11:3052-3060 (2016) 
 
Prostaglandin G/H synthase 2 [18-604,S516A]
Name:Prostaglandin G/H synthase 2 [18-604,S516A]
Type:Protein
Mol. Mass.:67244.20
Organism:Mus musculus (Mouse)
Description:Sequence based on 4OTJ
Residue:587
BDBM50312668
NameBDBM50312668
Synonyms:CHEMBL1076638 N-{(Succinylpodophyllotoxinyl)but-4-yl}-2-{1-(4-chlorobenzoyl)-5-methoxy-2-methyl-1H-indol-3-yl}acetamide
TypeSmall organic molecule
Emp. Form.C49H50ClN3O13
Mol. Mass.924.387
SMILESCOc1ccc2n(C(=O)c3ccc(Cl)cc3)c(C)c(CC(=O)NCCCCNC(=O)CCC(=O)O[C@H]3[C@@H]4COC(=O)[C@H]4[C@@H](c4cc(OC)c(OC)c(OC)c4)c4cc5OCOc5cc34)c2c1