Reaction Details
TargetExtracellular calcium-sensing receptor
LigandBDBM205508
Substrate/Competitorn/a
Meas. Tech.Agonistic Activity Assay
pH7.2±n/a
Temperature310.15±n/a K
EC50 39±n/a nM
Commentsextracted
Citation Sugiki, MOkamatsu, TYano, TTaniguchi, S Alkylamine derivative US Patent US9253997 Publication Date 2/9/2016
 
Extracellular calcium-sensing receptor
Name:Extracellular calcium-sensing receptor
Type:Protein
Mol. Mass.:120663.13
Organism:Homo sapiens (Human)
Description:P41180
Residue:1078
BDBM205508
NameBDBM205508
Synonyms:US9253997, 41
TypeSmall organic molecule
Emp. Form.C11H14ClN3O7S
Mol. Mass.367.763
SMILESN[C@@H](CCC(=O)Nc1cc(Cl)cc(c1O)S(O)(=O)=O)C(=O)NO