Reaction Details
TargetProstaglandin D2 receptor 2
LigandBDBM205761
Substrate/Competitorn/a
Meas. Tech.Radioligand Displacement Assay
pH7±n/a
Temperature298.15±n/a K
IC50 1±n/a nM
Commentsextracted
Citation Aissaoui, HBoss, CRichard-Bildstein, SSiegrist, R Heterocyclyl derivatives and their use as prostaglandin D2 receptor modulators US Patent US9255090 Publication Date 2/9/2016
 
Prostaglandin D2 receptor 2
Name:Prostaglandin D2 receptor 2
Type:Enzyme
Mol. Mass.:43295.45
Organism:Homo sapiens (Human)
Description:Q9Y5Y4
Residue:395
BDBM205761
NameBDBM205761
Synonyms:US9255090, 230
TypeSmall organic molecule
Emp. Form.C30H30FNO4
Mol. Mass.487.5619
SMILESCCOc1cc(CC(O)=O)ccc1-c1ccc(F)c2CCN(Cc12)C(=O)CC1(CC1)c1ccccc1