Reaction Details
TargetProstaglandin D2 receptor 2
LigandBDBM205768
Substrate/Competitorn/a
Meas. Tech.Radioligand Displacement Assay
pH7±n/a
Temperature298.15±n/a K
IC50 0.3±n/a nM
Commentsextracted
Citation Aissaoui, HBoss, CRichard-Bildstein, SSiegrist, R Heterocyclyl derivatives and their use as prostaglandin D2 receptor modulators US Patent US9255090 Publication Date 2/9/2016
 
Prostaglandin D2 receptor 2
Name:Prostaglandin D2 receptor 2
Type:Enzyme
Mol. Mass.:43295.45
Organism:Homo sapiens (Human)
Description:Q9Y5Y4
Residue:395
BDBM205768
NameBDBM205768
Synonyms:US9255090, 237
TypeSmall organic molecule
Emp. Form.C30H31F2NO4
Mol. Mass.507.5682
SMILESCCOc1cc(CC(O)=O)ccc1-c1ccc(F)c2CCN(Cc12)C(=O)CC(C)(C)c1ccc(F)cc1