Reaction Details
TargetPoly [ADP-ribose] polymerase tankyrase-2
LigandBDBM27566
Substrate/Competitorn/a
Meas. Tech.Enzyme Assay
IC50 5.2±n/a nM
Citation Zhang, AMiao, ZYe, NHuan, XSong, ZChen, CChen, YDing, J Substituted [1,2,4]triazolo[4,3-a]pyrazines as PARP-1 inhibitors US Patent US9255106 Publication Date 2/9/2016
 
Poly [ADP-ribose] polymerase tankyrase-2
Name:Poly [ADP-ribose] polymerase tankyrase-2
Type:Enzyme
Mol. Mass.:126937.16
Organism:Homo sapiens (Human)
Description:Q9H2K2
Residue:1166
BDBM27566
NameBDBM27566
Synonyms:4-({3-[(4-cyclopropanecarbonylpiperazin-1-yl)carbonyl]-4-fluorophenyl}methyl)-1,2-dihydrophthalazin-1-one Olaparib US10597399, Compound AZD2281 US9255106, AZD2281
TypeSmall organic molecule
Emp. Form.C24H23FN4O3
Mol. Mass.434.4628
SMILESFc1ccc(Cc2n[nH]c(=O)c3ccccc23)cc1C(=O)N1CCN(CC1)C(=O)C1CC1