Reaction Details
TargetHistone deacetylase 1/11/4/6/8
LigandBDBM206281
Substrate/Competitorn/a
Meas. Tech.In vitro HDACs Inhibition Fluorescence Assay
IC50 189±n/a nM
Citation Wang, XLi, XLi, JHou, JQu, YYu, CHe, FXu, WWu, J Design, synthesis, and preliminary bioactivity evaluation of N(1) -hydroxyterephthalamide derivatives with indole cap as novel histone deacetylase inhibitors. Chem Biol Drug Des89:38-46 (2017) 
 
Histone deacetylase 1/11/4/6/8
Name:Histone deacetylase 1/11/4/6/8
Synonyms:Histone acetylases (HDACs)
Type:Protein
Mol. Mass.:n/a
Description:HeLa nuclear extract
Components:This complex has 5 components.
Component 1
Name:Histone deacetylase 1
Type:Enzyme
Mol. Mass.:55090.27
Organism:Homo sapiens (Human)
Description:Q13547
Residue:482
Component 2
Name:Histone deacetylase 8
Synonyms:HD8 HDAC8_HUMAN Histone deacetylase 8 (HDAC-8) | Human HDAC8
Type:Enzyme
Mol. Mass.:41749.60
Organism:Homo sapiens (Human)
Description:Q9BY41
Residue:377
Component 3
Name:Histone deacetylase 4
Synonyms:Cereblon/Histone deacetylase 4 HDAC4 Histone acetylase 4(HDAC4) KIAA0288
Type:Enzyme
Mol. Mass.:119049.39
Organism:Homo sapiens (Human)
Description:P56524
Residue:1084
Component 4
Name:Histone deacetylase 6
Synonyms:Cereblon/Histone deacetylase 6 HDAC6 Histone deacetylase 6 (HDAC6) KIAA0901 | ORF Names:JM21
Type:Chromatin regulator; hydrolase; repressor
Mol. Mass.:131381.51
Organism:Homo sapiens (Human)
Description:Q9UBN7
Residue:1215
Component 5
Name:Histone deacetylase 11
Synonyms:HD11 HDAC11 | Human HDAC11
Type:Chromatin regulator; hydrolase; repressor
Mol. Mass.:39187.66
Organism:Homo sapiens (Human)
Description:Q96DB2
Residue:347
BDBM206281
NameBDBM206281
Synonyms:(S)-N1-(1-((3-bromophenyl)amino)-3-(1H-indol-3-yl)-1-oxopropan-2-yl)-N4-hydroxyterephthalamide (12g)
TypeSmall organic molecule
Emp. Form.C24H19BrN4O4
Mol. Mass.507.336
SMILESONC(=O)c1ccc(cc1)C(=O)N[C@H](C(=O)Nc1cccc(Br)c1)c1c[nH]c2ccccc12