Reaction Details
TargetHistone deacetylase 4
LigandBDBM25150
Substrate/Competitorn/a
Meas. Tech.Enzymatic Inhibitory Assay
IC50 9.9e+3±n/a nM
Citation Wang, XLi, XLi, JHou, JQu, YYu, CHe, FXu, WWu, J Design, synthesis, and preliminary bioactivity evaluation of N(1) -hydroxyterephthalamide derivatives with indole cap as novel histone deacetylase inhibitors. Chem Biol Drug Des89:38-46 (2017) 
 
Histone deacetylase 4
Name:Histone deacetylase 4
Type:Enzyme
Mol. Mass.:119049.39
Organism:Homo sapiens (Human)
Description:P56524
Residue:1084
BDBM25150
NameBDBM25150
Synonyms:(2E)-N-hydroxy-3-[3-(phenylsulfamoyl)phenyl]prop-2-enamide Belinostat PXD101
TypeSmall organic molecule
Emp. Form.C15H14N2O4S
Mol. Mass.318.348
SMILESONC(=O)\C=C\c1cccc(c1)S(=O)(=O)Nc1ccccc1