Reaction Details
TargetCoagulation factor XI
LigandBDBM289805
Substrate/Competitorn/a
Meas. Tech.Factor XIa Assay
pH7.4±n/a
Temperature298.15±n/a K
Ki 4.21±n/a nM
Commentsextracted
Citation Lim, YGuo, ZAli, AEdmondson, SDLiu, WGallo-Etienne, GVWu, HGao, YStamford, AWYu, YKevin, NJAnand, RSha, DNeelamkavil, SFHussain, ZKumar, PMoningka, RDuffy, JLXu, JJiang, YChakrabarti, ASone, H Factor XIa inhibitors US Patent US10093683 Publication Date 10/9/2018
 
Coagulation factor XI
Name:Coagulation factor XI
Type:Enzyme
Mol. Mass.:70130.58
Organism:Homo sapiens (Human)
Description:P03951
Residue:625
BDBM289805
NameBDBM289805
Synonyms:US10093683, Example 116A | US10093683, Example 116B
TypeSmall organic molecule
Emp. Form.C28H30ClFN4O7
Mol. Mass.589.012
SMILESCOC(=O)Nc1ccc(cc1)C(=O)NC(C[C@@H]1CCCO1)C(=O)N1CCC[C@@]2(C1)OC(=O)Nc1ccc(Cl)c(F)c21