Reaction Details
TargetCoagulation factor XI
LigandBDBM289816
Substrate/Competitorn/a
Meas. Tech.Factor XIa Assay
pH7.4±n/a
Temperature298.15±n/a K
Ki 33.6±n/a nM
Commentsextracted
Citation Lim, YGuo, ZAli, AEdmondson, SDLiu, WGallo-Etienne, GVWu, HGao, YStamford, AWYu, YKevin, NJAnand, RSha, DNeelamkavil, SFHussain, ZKumar, PMoningka, RDuffy, JLXu, JJiang, YChakrabarti, ASone, H Factor XIa inhibitors US Patent US10093683 Publication Date 10/9/2018
 
Coagulation factor XI
Name:Coagulation factor XI
Type:Enzyme
Mol. Mass.:70130.58
Organism:Homo sapiens (Human)
Description:P03951
Residue:625
BDBM289816
NameBDBM289816
Synonyms:US10093683, Example 122a US10093683, Example 122c | US10093683, Example 122d
TypeSmall organic molecule
Emp. Form.C31H28ClN5O5
Mol. Mass.586.038
SMILESCOC(=O)Nc1ccc(cc1)-c1c[nH]c(n1)C(Cc1ccccc1)C(=O)N1CCC2(C1)OC(=O)Nc1ccc(Cl)cc21