Reaction Details
TargetCoagulation factor XI
LigandBDBM289823
Substrate/Competitorn/a
Meas. Tech.Factor XIa Assay
pH7.4±n/a
Temperature298.15±n/a K
Ki 154±n/a nM
Commentsextracted
Citation Lim, YGuo, ZAli, AEdmondson, SDLiu, WGallo-Etienne, GVWu, HGao, YStamford, AWYu, YKevin, NJAnand, RSha, DNeelamkavil, SFHussain, ZKumar, PMoningka, RDuffy, JLXu, JJiang, YChakrabarti, ASone, H Factor XIa inhibitors US Patent US10093683 Publication Date 10/9/2018
 
Coagulation factor XI
Name:Coagulation factor XI
Type:Enzyme
Mol. Mass.:70130.58
Organism:Homo sapiens (Human)
Description:P03951
Residue:625
BDBM289823
NameBDBM289823
Synonyms:US10093683, Example 126B
TypeSmall organic molecule
Emp. Form.C26H32ClN3O5Si
Mol. Mass.530.088
SMILESCOC(=O)Nc1ccc(cc1)-c1nc(C(Cc2ccccc2)C(O)=O)n(COCC[Si](C)(C)C)c1Cl