Reaction Details
TargetKappa-type opioid receptor
LigandBDBM50090694
Substrate/Competitorn/a
Meas. Tech.Ligand Binding Assays
pH7.4±n/a
Temperature298.15±n/a K
Ki 0.08±n/a nM
Commentsextracted
Citation Lewis, JHusbands, S Orvinol and thevinol derivatives useful in the treatment of depression US Patent US9259422 Publication Date 2/16/2016
 
Kappa-type opioid receptor
Name:Kappa-type opioid receptor
Type:G Protein-Coupled Receptor (GPCR)
Mol. Mass.:42648.76
Organism:Homo sapiens (Human)
Description:P41145
Residue:380
BDBM50090694
NameBDBM50090694
Synonyms:CHEMBL3581740 US9480684, 22, R = Ph- BU128
TypeSmall organic molecule
Emp. Form.C31H35NO4
Mol. Mass.485.6139
SMILES[H][C@@]12Oc3c4c(C[C@@]5([H])N(CC6CC6)CC[C@@]14[C@]51C[C@](C)([C@H](O)c4ccccc4)[C@]2(OC)C=C1)ccc3O