Reaction Details
TargetKappa-type opioid receptor
LigandBDBM50015009
Substrate/Competitorn/a
Meas. Tech.Ligand Binding Assays
pH7.4±n/a
Temperature298.15±n/a K
Ki 0.1±n/a nM
Commentsextracted
Citation Lewis, JHusbands, S Orvinol and thevinol derivatives useful in the treatment of depression US Patent US9259422 Publication Date 2/16/2016
 
Kappa-type opioid receptor
Name:Kappa-type opioid receptor
Type:G Protein-Coupled Receptor (GPCR)
Mol. Mass.:42648.76
Organism:Homo sapiens (Human)
Description:P41145
Residue:380
BDBM50015009
NameBDBM50015009
Synonyms:CHEMBL3262367 US9480684, 7a, R = 3,5- diMePh- BU10100
TypeSmall organic molecule
Emp. Form.C33H41NO4
Mol. Mass.515.6829
SMILES[H][C@@]12Oc3c4c(C[C@@]5([H])N(CC6CC6)CC[C@@]14[C@@]51CC[C@@]2(OC)[C@]([H])(C1)[C@](C)(O)c1cc(C)cc(C)c1)ccc3O