Reaction Details
TargetKappa-type opioid receptor
LigandBDBM50015011
Substrate/Competitorn/a
Meas. Tech.Ligand Binding Assays
pH7.4±n/a
Temperature298.15±n/a K
Ki 0.16±n/a nM
Commentsextracted
Citation Lewis, JHusbands, S Orvinol and thevinol derivatives useful in the treatment of depression US Patent US9259422 Publication Date 2/16/2016
 
Kappa-type opioid receptor
Name:Kappa-type opioid receptor
Type:G Protein-Coupled Receptor (GPCR)
Mol. Mass.:42648.76
Organism:Homo sapiens (Human)
Description:P41145
Residue:380
BDBM50015011
NameBDBM50015011
Synonyms:CHEMBL3262363 US9480684, 7a, 2- MePh- BU10101
TypeSmall organic molecule
Emp. Form.C32H39NO4
Mol. Mass.501.6564
SMILES[H][C@@]12Oc3c4c(C[C@@]5([H])N(CC6CC6)CC[C@@]14[C@@]51CC[C@@]2(OC)[C@]([H])(C1)[C@](C)(O)c1ccccc1C)ccc3O