Reaction Details
TargetMitogen-activated protein kinase 1
LigandBDBM120086
Substrate/Competitorn/a
Meas. Tech.ERK-2 Enzymatic Assay
pH7.3±n/a
IC50 3.9±n/a nM
Commentsextracted
Citation Blake, JFChicarelli, MJGarrey, RFGaudino, JGrina, JMoreno, DAMohr, PJRen, LSchwarz, JChen, HRobarge, KZhou, A Serine/threonine kinase inhibitors US Patent US9259470 Publication Date 2/16/2016
 
Mitogen-activated protein kinase 1
Name:Mitogen-activated protein kinase 1
Type:Ser/Thr Protein Kinase
Mol. Mass.:41392.76
Organism:Homo sapiens (Human)
Description:P28482
Residue:360
BDBM120086
NameBDBM120086
Synonyms:US8697715, 1 | US9259470, 1
TypeSmall organic molecule
Emp. Form.C22H22ClFN4O3
Mol. Mass.444.886
SMILESOC[C@H](c1ccc(Cl)c(F)c1)n1ccc(cc1=O)-c1ccnc(NC2CCOCC2)n1