Reaction Details
TargetMitogen-activated protein kinase 14
LigandBDBM206344
Substrate/Competitorn/a
Meas. Tech.Fluorescence Resonance Energy Transfer (FRET) Assay
IC50 2.5±n/a nM
Citation King-Underwood, JIto, KStrong, PRapeport, WGCharron, CEMurray, PJWilliams, JGOnions, ST P38 MAP kinase inhibitors US Patent US9260410 Publication Date 2/16/2016
 
Mitogen-activated protein kinase 14
Name:Mitogen-activated protein kinase 14
Type:Serine/threonine-protein kinase
Mol. Mass.:41286.76
Organism:Homo sapiens (Human)
Description:Q16539
Residue:360
BDBM206344
NameBDBM206344
Synonyms:US9260410, 2
TypeSmall organic molecule
Emp. Form.C33H34N6O3
Mol. Mass.562.6615
SMILESCC(=O)Nc1cc(COc2ccc(NC(=O)Nc3cc(nn3-c3ccc(C)cc3)C(C)(C)C)c3ccccc23)ccn1