Reaction Details
TargetTyrosine-protein kinase BTK
LigandBDBM206359
Substrate/Competitorn/a
Meas. Tech.Biochemical Btk Assay
pH7.5±n/a
Ki 0.683±n/a nM
Commentsextracted
Citation Crawford, JJWei, BYoung, WB Heteroaryl pyridone and aza-pyridone compounds with electrophilic functionality US Patent US9260415 Publication Date 2/16/2016
 
Tyrosine-protein kinase BTK
Name:Tyrosine-protein kinase BTK
Type:Enzyme
Mol. Mass.:76289.95
Organism:Homo sapiens (Human)
Description:Q06187
Residue:659
BDBM206359
NameBDBM206359
Synonyms:US9260415, 110
TypeSmall organic molecule
Emp. Form.C35H40N8O4
Mol. Mass.636.7433
SMILESCN(CCNC(=O)C=C)c1cccc(Nc2cc(cn(C)c2=O)-c2ccnc(N3CCn4c5CC(C)(C)Cc5cc4C3=O)c2CO)n1