Reaction Details
TargetTyrosine-protein kinase BTK
LigandBDBM206363
Substrate/Competitorn/a
Meas. Tech.Biochemical Btk Assay
pH7.5±n/a
Ki 0.888±n/a nM
Commentsextracted
Citation Crawford, JJWei, BYoung, WB Heteroaryl pyridone and aza-pyridone compounds with electrophilic functionality US Patent US9260415 Publication Date 2/16/2016
 
Tyrosine-protein kinase BTK
Name:Tyrosine-protein kinase BTK
Type:Enzyme
Mol. Mass.:76289.95
Organism:Homo sapiens (Human)
Description:Q06187
Residue:659
BDBM206363
NameBDBM206363
Synonyms:US9260415, 114
TypeSmall organic molecule
Emp. Form.C37H42N8O4
Mol. Mass.662.7806
SMILESCn1cc(cc(Nc2cccc(n2)N2CCC[C@@H](C2)NC(=O)C=C)c1=O)-c1ccnc(N2CCn3c4CC(C)(C)Cc4cc3C2=O)c1CO