Reaction Details
TargetTyrosine-protein kinase BTK
LigandBDBM206366
Substrate/Competitorn/a
Meas. Tech.Biochemical Btk Assay
pH7.5±n/a
Ki 0.576±n/a nM
Commentsextracted
Citation Crawford, JJWei, BYoung, WB Heteroaryl pyridone and aza-pyridone compounds with electrophilic functionality US Patent US9260415 Publication Date 2/16/2016
 
Tyrosine-protein kinase BTK
Name:Tyrosine-protein kinase BTK
Type:Enzyme
Mol. Mass.:76289.95
Organism:Homo sapiens (Human)
Description:Q06187
Residue:659
BDBM206366
NameBDBM206366
Synonyms:US9260415, 117
TypeSmall organic molecule
Emp. Form.C34H30FN7O5S
Mol. Mass.667.709
SMILESCn1cc(cc(Nc2cccc(OCCNC(=O)C(=C)C#N)n2)c1=O)-c1cc(F)cc(c1CO)-n1ncc2c3CCCCc3sc2c1=O