Reaction Details
TargetBeta-2 adrenergic receptor
LigandBDBM50213114
Substrate/Competitorn/a
Meas. Tech.Beta2-AR Binding Assay
pH7.7±n/a
Kd 27542±n/a nM
Commentsextracted
Citation Wainer, IWBernier, MToll, LRJimenez, LA Use of fenoterol and fenoterol analogues in the treatment of glioblastomas and astrocytomas US Patent US9492405 Publication Date 11/15/2016
 
Beta-2 adrenergic receptor
Name:Beta-2 adrenergic receptor
Type:n/a
Mol. Mass.:46461.69
Organism:Homo sapiens (Human)
Description:P07550
Residue:413
BDBM50213114
NameBDBM50213114
Synonyms:(S,S)-(+)-fenoterol US10617654, Compound (S,S)-1 US9492405, 31
TypeSmall organic molecule
Emp. Form.C17H21NO4
Mol. Mass.303.3529
SMILESC[C@@H](Cc1ccc(O)cc1)NC[C@@H](O)c1cc(O)cc(O)c1