Reaction Details
TargetBeta-2 adrenergic receptor
LigandBDBM206777
Substrate/Competitorn/a
Meas. Tech.Beta2-AR Binding Assay
pH7.7±n/a
Kd 100000±n/a nM
Commentsextracted
Citation Wainer, IWBernier, MToll, LRJimenez, LA Use of fenoterol and fenoterol analogues in the treatment of glioblastomas and astrocytomas US Patent US9492405 Publication Date 11/15/2016
 
Beta-2 adrenergic receptor
Name:Beta-2 adrenergic receptor
Type:n/a
Mol. Mass.:46461.69
Organism:Homo sapiens (Human)
Description:P07550
Residue:413
BDBM206777
NameBDBM206777
Synonyms:(S,R)- 6 | US9492405, (S,R)-6
TypeSmall organic molecule
Emp. Form.C15H25NO3
Mol. Mass.267.3639
SMILESCCCCC[C@@H](C)NC[C@@H](O)c1cc(O)cc(O)c1