Reaction Details
TargetPutative FAD-containing monooxygenase MymA
LigandBDBM50336507
Substrate/Competitorn/a
Meas. Tech.MymA Inhibition Assay
IC50 4.9e+3±n/a nM
Citation Saraav, IPandey, KMisra, RSingh, SSharma, MSharma, S Characterization of MymA protein as a flavin-containing monooxygenase and as a target of isoniazid. Chem Biol Drug Des89:152-160 (2017) 
 
Putative FAD-containing monooxygenase MymA
Name:Putative FAD-containing monooxygenase MymA
Type:Protein
Mol. Mass.:55489.29
Organism:Mycobacterium tuberculosis
Description:P9WNF7
Residue:495
BDBM50336507
NameBDBM50336507
Synonyms:4-pyridinecarbohydrazide(Isoniazid) Dow-isoniazid INH Isoniazid (INH) Isonicotinic acid hydrazide(Isoniazid) Laniazid Rimifon isoniazid isonicotinhydrazide isonicotinyl hydrazide | pyridine-4-carbohydrazide
TypeSmall organic molecule
Emp. Form.C6H7N3O
Mol. Mass.137.1393
SMILESNNC(=O)c1ccncc1