Reaction Details
TargetPhosphatidylinositol 3-kinase regulatory subunit alpha [Q431L,Q432E,D433V,Q434L,V435F,V436Q,K437G,E438P]/4,5-bisphosphate 3-kinase catalytic subunit alpha isoform
LigandBDBM207349
Substrate/Competitorn/a
Meas. Tech.Biochemical Assay
Ki<0.018±n/a nM
Citation Chen, PCheng, HDeal, JGGallego, GMJalaie, MKath, JCOrr, STShen, HZehnder, LR Dihydropyrrolopyrimidine derivatives US Patent US9260439 Publication Date 2/16/2016
 
Phosphatidylinositol 3-kinase regulatory subunit alpha [Q431L,Q432E,D433V,Q434L,V435F,V436Q,K437G,E438P]/4,5-bisphosphate 3-kinase catalytic subunit alpha isoform
Name:Phosphatidylinositol 3-kinase regulatory subunit alpha [Q431L,Q432E,D433V,Q434L,V435F,V436Q,K437G,E438P]/4,5-bisphosphate 3-kinase catalytic subunit alpha isoform
Synonyms:p110alpha-iSH2 p85alpha Complex
Type:Protein
Mol. Mass.:n/a
Description:n/a
Components:This complex has 2 components.
Component 1
Name:Phosphatidylinositol 4,5-bisphosphate 3-kinase catalytic subunit alpha isoform
Type:Enzyme Subunit
Mol. Mass.:124294.87
Organism:Homo sapiens (Human)
Description:P42336
Residue:1068
Component 2
Name:Phosphatidylinositol 3-kinase regulatory subunit alpha [Q431L,Q432E,D433V,Q434L,V435F,V436Q,K437G,E438P]
Synonyms:GRB1 PI3-kinase subunit p85-alpha | PIK3R1
Type:Protein
Mol. Mass.:83521.83
Organism:Homo sapiens (Human)
Description:Aminoacids 431-438 of p85α replaced with LEVLFQGP
Residue:724
BDBM207349
NameBDBM207349
Synonyms:US9260439, 233
TypeSmall organic molecule
Emp. Form.C23H33N9O2
Mol. Mass.467.5672
SMILESCC(C)(N)C(=O)N1CC[C@](C)(C1)N1CCc2c1nc(nc2-c1cnc(N)nc1)N1CCOCC1