Reaction Details
TargetPhosphatidylinositol 3-kinase regulatory subunit alpha [Q431L,Q432E,D433V,Q434L,V435F,V436Q,K437G,E438P]/4,5-bisphosphate 3-kinase catalytic subunit alpha isoform
LigandBDBM207343
Substrate/Competitorn/a
Meas. Tech.Biochemical Assay
Ki<0.018±n/a nM
Citation Chen, PCheng, HDeal, JGGallego, GMJalaie, MKath, JCOrr, STShen, HZehnder, LR Dihydropyrrolopyrimidine derivatives US Patent US9260439 Publication Date 2/16/2016
 
Phosphatidylinositol 3-kinase regulatory subunit alpha [Q431L,Q432E,D433V,Q434L,V435F,V436Q,K437G,E438P]/4,5-bisphosphate 3-kinase catalytic subunit alpha isoform
Name:Phosphatidylinositol 3-kinase regulatory subunit alpha [Q431L,Q432E,D433V,Q434L,V435F,V436Q,K437G,E438P]/4,5-bisphosphate 3-kinase catalytic subunit alpha isoform
Synonyms:p110alpha-iSH2 p85alpha Complex
Type:Protein
Mol. Mass.:n/a
Description:n/a
Components:This complex has 2 components.
Component 1
Name:Phosphatidylinositol 4,5-bisphosphate 3-kinase catalytic subunit alpha isoform
Type:Enzyme Subunit
Mol. Mass.:124294.87
Organism:Homo sapiens (Human)
Description:P42336
Residue:1068
Component 2
Name:Phosphatidylinositol 3-kinase regulatory subunit alpha [Q431L,Q432E,D433V,Q434L,V435F,V436Q,K437G,E438P]
Synonyms:GRB1 PI3-kinase subunit p85-alpha | PIK3R1
Type:Protein
Mol. Mass.:83521.83
Organism:Homo sapiens (Human)
Description:Aminoacids 431-438 of p85α replaced with LEVLFQGP
Residue:724
BDBM207343
NameBDBM207343
Synonyms:US9260439, 527
TypeSmall organic molecule
Emp. Form.C25H34N8O3
Mol. Mass.494.5893
SMILESC[C@H]1COCCN1c1nc2N(CCc2c(n1)-c1cnc(N)nc1)[C@@]12C[C@@H]1CN(C2)C(=O)OC(C)(C)C