Reaction Details
TargetTGF-beta receptor type-1
LigandBDBM172449
Substrate/Competitorn/a
Meas. Tech.ALK-5 Kinase Assay
pH7.6±n/a
Temperature277.15±n/a K
IC50 23.4±3.5 nM
Commentsextracted
Citation Barrett, SDKramer, JBBoys, MLChen, H Therapeutic pyrazolyl thienopyridines US Patent US9260450 Publication Date 2/16/2016
 
TGF-beta receptor type-1
Name:TGF-beta receptor type-1
Type:enzyme
Mol. Mass.:55968.24
Organism:Homo sapiens (Human)
Description:P36897
Residue:503
BDBM172449
NameBDBM172449
Synonyms:US9090625, 1 US9938289, 1
TypeSmall organic molecule
Emp. Form.C16H12N4S
Mol. Mass.292.358
SMILESCc1cccc(n1)-n1nccc1-c1cc2cnccc2s1