Reaction Details
TargetTGF-beta receptor type-1
LigandBDBM172458
Substrate/Competitorn/a
Meas. Tech.ALK-5 Kinase Assay
pH7.6±n/a
Temperature277.15±n/a K
IC50 18.9±7.73 nM
Commentsextracted
Citation Barrett, SDKramer, JBBoys, MLChen, H Therapeutic pyrazolyl thienopyridines US Patent US9260450 Publication Date 2/16/2016
 
TGF-beta receptor type-1
Name:TGF-beta receptor type-1
Type:enzyme
Mol. Mass.:55968.24
Organism:Homo sapiens (Human)
Description:P36897
Residue:503
BDBM172458
NameBDBM172458
Synonyms:US9090625, 13 US9938289, 13
TypeSmall organic molecule
Emp. Form.C19H16N4S
Mol. Mass.332.422
SMILESCc1cccc(n1)-n1nc2CCCc2c1-c1cc2ccncc2s1