Reaction Details
TargetHistone deacetylase 3
LigandBDBM50005711
Substrate/Competitorn/a
Meas. Tech.HDAC enzyme inhibitionAssay
IC50 9.6±n/a nM
Citation Rusche, JRPeet, NPHopper, AT Compositions including 6-aminohexanoic acid derivatives as HDAC inhibitors US Patent US9265734 Publication Date 2/23/2016
 
Histone deacetylase 3
Name:Histone deacetylase 3
Type:Enzyme
Mol. Mass.:48829.55
Organism:Homo sapiens (Human)
Description:O15379
Residue:428
BDBM50005711
NameBDBM50005711
Synonyms:CHEBI:46024 TRICHOSTATIN Trichostatin A (TSA) US10722597, Compound Trichostatin US20230322747, Compound trichostatin A | US9265734, TSA
TypeSmall organic molecule
Emp. Form.C17H22N2O3
Mol. Mass.302.3682
SMILESC[C@H](\C=C(/C)\C=C\C(=O)NO)C(=O)c1ccc(cc1)N(C)C