Reaction Details
TargetDisintegrin and metalloproteinase domain-containing protein 9
LigandBDBM207967
Substrate/Competitorn/a
Meas. Tech.Inhibition Assay
IC50>10000±n/a nM
Citation Clary, LPascal, J 4-alkoxy-N-(2-hydroxycarbamoyl-2-piperidinyl-ethyl)-benzamide compounds as selective TACE-inhibitors for the treatment of inflammatory diseases US Patent US9266848 Publication Date 2/23/2016
 
Disintegrin and metalloproteinase domain-containing protein 9
Name:Disintegrin and metalloproteinase domain-containing protein 9
Type:Enzyme
Mol. Mass.:90567.68
Organism:Homo sapiens (Human)
Description:Q13443
Residue:819
BDBM207967
NameBDBM207967
Synonyms:US9266848, 5
TypeSmall organic molecule
Emp. Form.C21H26N4O4
Mol. Mass.398.4555
SMILESONC(=O)[C@H](CNC(=O)c1ccc(OCc2ccncc2)cc1)N1CCCCC1