Reaction Details
TargetSerine/threonine-protein kinase WNK1 [1-491]
LigandBDBM207990
Substrate/Competitorn/a
Meas. Tech.WNK In Vitro Radiometric Assays
pH7.3±n/a
IC50 64±n/a nM
Commentsextracted
Citation Yamada, KZhang, JHXie, XReinhardt, JXie, AQLaSala, DKohls, DYowe, DBurdick, DYoshisue, HWakai, HSchmidt, IGunawan, JYasoshima, KYue, QKKato, MMogi, MIdamakanti, NKreder, NDrueckes, PPandey, PKawanami, THuang, WYagi, YIDeng, ZPark, HM Discovery and Characterization of Allosteric WNK Kinase Inhibitors. ACS Chem Biol11:3338-3346 (2016) 
 
Serine/threonine-protein kinase WNK1 [1-491]
Name:Serine/threonine-protein kinase WNK1 [1-491]
Type:n/a
Mol. Mass.:53757.75
Organism:Homo sapiens (Human)
Description:Q9H4A3 (1-491aa). Carna Biosciences, cat no. 05-179
Residue:491
BDBM207990
NameBDBM207990
Synonyms:(2-((4-Chlorobenzyl)oxy)phenyl)(5-(2-(methylamino)thiazol-4-yl)indolin-1-yl)methanone (Compound 2)
TypeSmall organic molecule
Emp. Form.C26H22ClN3O2S
Mol. Mass.475.99
SMILESCNc1nc(cs1)-c1ccc2N(CCc2c1)C(=O)c1ccccc1OCc1ccc(Cl)cc1