Reaction Details
TargetAcyl-protein thioesterase 2
LigandBDBM207994
Substrate/Competitorn/a
Meas. Tech.Fluorescence Binding Assays
Temperature298.15±n/a K
IC50 1.2e+4±n/a nM
Kd 5200±0.0 nM
Commentsextracted
Citation Won, SJDavda, DLabby, KJHwang, SYPricer, RMajmudar, JDArmacost, KARodriguez, LARodriguez, CLChong, FSTorossian, KAPalakurthi, JHur, ESMeagher, JLBrooks, CLStuckey, JAMartin, BR Molecular Mechanism for Isoform-Selective Inhibition of Acyl Protein Thioesterases 1 and 2 (APT1 and APT2). ACS Chem Biol11:3374-3382 (2016) 
 
Acyl-protein thioesterase 2
Name:Acyl-protein thioesterase 2
Type:Protein
Mol. Mass.:24740.23
Organism:Homo sapiens (Human)
Description:O95372
Residue:231
BDBM207994
NameBDBM207994
Synonyms:ML349-sulfoxide
TypeSmall organic molecule
Emp. Form.C23H22N2O3S2
Mol. Mass.438.562
SMILESCOc1ccc(cc1)N1CCN(CC1)C(=O)c1cc2CS(=O)c3ccccc3-c2s1