Reaction Details
TargetMu-type opioid receptor
LigandBDBM50105085
Substrate/Competitorn/a
Meas. Tech.GTPyS binding assay
pH7.4±n/a
Temperature303.15±n/a K
IC50 752±n/a nM
Commentsextracted
Citation Riggs-Sauthier, JDeng, BRiley, TA Oligomer-opioid agonist conjugates US Patent US9233167 Publication Date 1/12/2016
 
Mu-type opioid receptor
Name:Mu-type opioid receptor
Type:G Protein-Coupled Receptor (GPCR)
Mol. Mass.:44789.51
Organism:Homo sapiens (Human)
Description:P35372
Residue:400
BDBM50105085
NameBDBM50105085
Synonyms:17-cyclobutylmethyl-4,5alpha-epoxymorphinan-3,6alpha,14-triol N-cyclobutylmethyl-4,5alpha-epoxy-3,6alpha,14-morphinantriol US10231963, Table B.1 US11534436, Compound Table B.1 US9656961, Example 00118 | USRE49340, Rank 9
TypeSmall organic molecule
Emp. Form.C21H27NO4
Mol. Mass.357.4434
SMILESO[C@H]1CC[C@@]2(O)[C@H]3Cc4ccc(O)c5O[C@@H]1[C@]2(CCN3CC1CCC1)c45