Reaction Details
TargetMu-type opioid receptor
LigandBDBM208986
Substrate/Competitorn/a
Meas. Tech.Scintillation Proximity Assay (SPA)
Temperature298.15±n/a K
Ki 39.4±n/a nM
Commentsextracted
Citation Riggs-Sauthier, JDeng, BRiley, TA Oligomer-opioid agonist conjugates US Patent US9233167 Publication Date 1/12/2016
 
Mu-type opioid receptor
Name:Mu-type opioid receptor
Type:G Protein-Coupled Receptor (GPCR)
Mol. Mass.:44789.51
Organism:Homo sapiens (Human)
Description:P35372
Residue:400
BDBM208986
NameBDBM208986
Synonyms:US9233167, a-6-mPEG5-O-Morphine
TypeSmall organic molecule
Emp. Form.C28H43NO9
Mol. Mass.537.6423
[C@H]1CC[C@@]2(O)C3Cc4ccc(O)c5O[C@@H]1[C@]2(CCN3C)c45