Reaction Details
TargetMu-type opioid receptor
LigandBDBM50370595
Substrate/Competitorn/a
Meas. Tech.Scintillation Proximity Assay (SPA)
Temperature298.15±n/a K
Ki 133.48±n/a nM
Commentsextracted
Citation Riggs-Sauthier, JDeng, BRiley, TA Oligomer-opioid agonist conjugates US Patent US9233167 Publication Date 1/12/2016
 
Mu-type opioid receptor
Name:Mu-type opioid receptor
Type:G Protein-Coupled Receptor (GPCR)
Mol. Mass.:44789.51
Organism:Homo sapiens (Human)
Description:P35372
Residue:400
BDBM50370595
NameBDBM50370595
Synonyms:OXYCODONE US1184575, oxycodone | US9233167, Oxycodone
TypeSmall organic molecule
Emp. Form.C18H21NO4
Mol. Mass.315.3636
SMILESCOc1ccc2C[C@H]3N(C)CC[C@@]45[C@@H](Oc1c24)C(=O)CC[C@@]35O