Reaction Details
TargetMu-type opioid receptor
LigandBDBM208990
Substrate/Competitorn/a
Meas. Tech.Scintillation Proximity Assay (SPA)
Temperature298.15±n/a K
Ki 653.9±n/a nM
Commentsextracted
Citation Riggs-Sauthier, JDeng, BRiley, TA Oligomer-opioid agonist conjugates US Patent US9233167 Publication Date 1/12/2016
 
Mu-type opioid receptor
Name:Mu-type opioid receptor
Type:G Protein-Coupled Receptor (GPCR)
Mol. Mass.:44789.51
Organism:Homo sapiens (Human)
Description:P35372
Residue:400
BDBM208990
NameBDBM208990
Synonyms:US9233167, a-6-mPEG1-O-Hydroxycodone
TypeSmall organic molecule
Emp. Form.C21H29NO5
Mol. Mass.375.4587
SMILESCOCCO[C@H]1CC[C@@]2(O)C3Cc4ccc(OC)c5O[C@@H]1[C@]2(CCN3C)c45