Reaction Details
TargetMu-type opioid receptor
LigandBDBM208991
Substrate/Competitorn/a
Meas. Tech.Scintillation Proximity Assay (SPA)
Temperature298.15±n/a K
Ki 631.76±n/a nM
Commentsextracted
Citation Riggs-Sauthier, JDeng, BRiley, TA Oligomer-opioid agonist conjugates US Patent US9233167 Publication Date 1/12/2016
 
Mu-type opioid receptor
Name:Mu-type opioid receptor
Type:G Protein-Coupled Receptor (GPCR)
Mol. Mass.:44789.51
Organism:Homo sapiens (Human)
Description:P35372
Residue:400
BDBM208991
NameBDBM208991
Synonyms:US9233167, a-6-mPEG2-O-Hydroxycodone
TypeSmall organic molecule
Emp. Form.C23H33NO6
Mol. Mass.419.5112
SMILESCOCCOCCO[C@H]1CC[C@@]2(O)C3Cc4ccc(OC)c5O[C@@H]1[C@]2(CCN3C)c45