Reaction Details
TargetKappa-type opioid receptor
LigandBDBM208981
Substrate/Competitorn/a
Meas. Tech.Scintillation Proximity Assay (SPA)
Temperature298.15±n/a K
Ki 118.38±n/a nM
Commentsextracted
Citation Riggs-Sauthier, JDeng, BRiley, TA Oligomer-opioid agonist conjugates US Patent US9233167 Publication Date 1/12/2016
 
Kappa-type opioid receptor
Name:Kappa-type opioid receptor
Type:G Protein-Coupled Receptor (GPCR)
Mol. Mass.:42648.76
Organism:Homo sapiens (Human)
Description:P41145
Residue:380
BDBM208981
NameBDBM208981
Synonyms:(4R,4aR,7S,7aR,12bS)-3-methyl-2,3,4,4a,7,7a-hexahydro-1H-4,12-methanobenzofuro[3,2-e]isoquinoline-7,9-diol | US9233167, Morphine
TypeSmall organic molecule
Emp. Form.C18H21NO3
Mol. Mass.299.3642
SMILESCO[C@H]1C=CC2C3Cc4ccc(O)c5OC1[C@]2(CCN3C)c45