Reaction Details
TargetMu-type opioid receptor
LigandBDBM209009
Substrate/Competitorn/a
Meas. Tech.Binding of PEG-Nalbuphine assays
Ki 79.55±0.0 nM
Citation Riggs-Sauthier, JDeng, BRiley, TA Oligomer-opioid agonist conjugates US Patent US9233167 Publication Date 1/12/2016
 
Mu-type opioid receptor
Name:Mu-type opioid receptor
Type:G Protein-Coupled Receptor (GPCR)
Mol. Mass.:44789.51
Organism:Homo sapiens (Human)
Description:P35372
Residue:400
BDBM209009
NameBDBM209009
Synonyms:US9233167, 6-O-mPEG8-Nalbuphine
TypeSmall organic molecule
Emp. Form.C38H61NO12
Mol. Mass.723.8904
[C@H]1CC[C@@]2(O)[C@H]3Cc4ccc(O)c5OC1[C@]2(CCN3CC1CCC1)c45