Reaction Details
TargetDelta-type opioid receptor
LigandBDBM209010
Substrate/Competitorn/a
Meas. Tech.Binding of PEG-Nalbuphine assays
Ki 313.8±0.0 nM
Citation Riggs-Sauthier, JDeng, BRiley, TA Oligomer-opioid agonist conjugates US Patent US9233167 Publication Date 1/12/2016
 
Delta-type opioid receptor
Name:Delta-type opioid receptor
Type:G Protein-Coupled Receptor (GPCR)
Mol. Mass.:40382.98
Organism:Homo sapiens (Human)
Description:Competition binding assays were carried out using membrane preparations from transfected HN9.10 cells that constitutively expressed the delta opioid receptor.
Residue:372
BDBM209010
NameBDBM209010
Synonyms:US9233167, 6-O-mPEG7-Nalbuphine
TypeSmall organic molecule
Emp. Form.C36H57NO11
Mol. Mass.679.8379
[C@H]1CC[C@@]2(O)[C@H]3Cc4ccc(O)c5OC1[C@]2(CCN3CC1CCC1)c45