Reaction Details
TargetGenome polyprotein
LigandBDBM208063
Substrate/Competitorn/a
Meas. Tech.ELISA-Based Assay
IC50 1.5±n/a nM
Citation McComas, CCLiverton, NJHabermann, JKoch, UNarjes, FLi, PPeng, XSoll, RWu, HPalani, AHe, SDai, XLiu, HLai, ZLondon, CXiao, DZorn, NNargund, R Tetracyclic heterocycle compounds and methods of use thereof for the treatment of viral diseases US Patent US9265773 Publication Date 2/23/2016
 
Genome polyprotein
Name:Genome polyprotein
Type:Protease Domain
Mol. Mass.:327221.49
Organism:Hepatitis C virus (HCV genotype 1a, isolate H)
Description:P27958
Residue:3011
BDBM208063
NameBDBM208063
Synonyms:US9265773, 6
TypeSmall organic molecule
Emp. Form.C31H23F2N5O5S
Mol. Mass.615.607
SMILESCNC(=O)c1c(oc2cc(N(C)S(C)(=O)=O)c(cc12)-c1ncc2OCn3c(cc4cc(F)ccc34)-c2n1)-c1ccc(F)cc1